{"text_format":"1","workbook":"xlsx","n_sheets":6,"sheets":["Admin","Sprachen","Anleitung","Titelblatt","Formular G1 + G2","Beschreibungen G2"],"not_rendered":{"charts":0,"images":3,"macros":1,"external_links":0,"defined_names":58,"comments":0,"pivot_tables":0},"unopened":[],"bounds":{"document_bytes":16777216,"sheet_cells":100000,"rows_first":2000,"rows_last":500,"rows_between":2000,"halvings":0,"cell_chars":16384,"cell_head_chars":4096},"cells_cut":0,"cells_raw":0,"read":"whole","date_system":"1900"}

{"sheet":"Admin","index":0,"n_rows":44,"n_cols":2,"rows_kept":44,"cut":false,"hidden":true,"merged":[[7,0,7,1]]}
["Admin"]
[]
[{"$f":"Sprachen!H14","v":"Version"}]
[{"$f":"Sprachen!H15","v":"Version:"},"v1.0"]
["Versionsdatum:","2016-08-22"]
[]
["Wichtige Hinweise für Admin"]
["- bei Blattschutz das Recht \"Zellen formatieren\" beibehalten."]
[]
[{"$f":"Sprachen!H17","v":"Dropdowns"}]
[{"$f":"Sprachen!H19","v":"Verwendetes Tool"}]
[{"$f":"Sprachen!H20","v":"a) EVA-Tool der EnFK"}]
[{"$f":"Sprachen!H21","v":"b) kantonsspezifisches Tool"}]
[{"$f":"Sprachen!H22","v":"Ja oder Nein"}]
[{"$f":"Sprachen!H23","v":"ja"}]
[{"$f":"Sprachen!H24","v":"nein"}]
[{"$f":"Sprachen!H25","v":"Energieträger"}]
[{"$f":"Sprachen!H26","v":"Ö"},{"$f":"Sprachen!H32","v":"Heizöl"}]
[{"$f":"Sprachen!H27","v":"G"},{"$f":"Sprachen!H33","v":"Erdgas"}]
[{"$f":"Sprachen!H28","v":"F"},{"$f":"Sprachen!H34","v":"Fernwärme/-kälte"}]
{"$rows_left_out":25}
{"sheet":"Sprachen","index":1,"n_rows":222,"n_cols":8,"rows_kept":222,"cut":false,"hidden":true,"merged":[[0,3,0,6]]}
[null,null,"Sprachen","Hinweise:\nDie FR- und IT-Texte sollten wenn immer möglich in etwa die gleiche Länge haben wie der DE-Text.\nSollten bei der Übersetzung Schwierigkeiten wegen der Excel-Formatierung entstehen, bitte Text zumindest inhaltlich übersetzten und Zelle farblich markieren, damit korrektes Format nachträglich eingestellt werden kann.\nDie Spalte \"Zuweisung\" muss für die Übersetzung nicht beachtet werden. Sie zeigt lediglich an, in welchem Arbeitsblatt und in welcher Zelle der Text im Excel-Tool angezeigt wird.\nZellen mit identischen Begriffen (Duplikaten) wurden ausgeblendet. Dies um zu verhindern dass diese fälschlicherweise doppelt übersetzt werden."]
[]
[null,null,"Zuweisung",null,"Übersetzung",null,null,"Aktive Sprache"]
["Nr.",null,"Arbeitsblatt","Zelle/Bereich","Deutsch","Französisch","Italienisch",{"$f":"Sprache","v":"DE"}]
[1,1,"Allgemein"]
[1.1000000000000001,{"$f":"B5+1","v":2},"Allgemein","Fusszeile Links","Ausführungsbestätigung zur EVA","Confirmation de mise en œuvre des mesures ACE","Conferma di esecuzione relativa ad ACE",{"$f":"IF(Sprache=\"DE\",E6,IF(Sprache=\"FR\",F6,IF(Sprache=\"IT\",G6,\"Fehler: Sprache wählen\")))","v":"Ausführungsbestätigung zur EVA"}]
[1.1000000000000001,{"$f":"B6+1","v":3},"Allgemein","Fusszeile Mitte",{"$f":"CONCATENATE(\"EVA-Ausführung \",Version)","v":"EVA-Ausführung v1.0"},{"$f":"CONCATENATE(\"ACE-Confirmation \",Version)","v":"ACE-Confirmation v1.0"},{"$f":"CONCATENATE(\"ACE-Conferma \",Version)","v":"ACE-Conferma v1.0"},"EVA-Ausführung v1.0"]
[1.1000000000000001,4,"Allgemein","Fusszeile Rechts","Konferenz Kantonaler Energiefachstellen (EnFK)","Conférence des services cantonaux de l’énergie (EnFK)","Conferenza dei servizi cantonali dell’energia (EnFK)","Konferenz Kantonaler Energiefachstellen (EnFK)"]
[1.1000000000000001,5,"Allgemein","Blattname","Anleitung","Introduction ","Guida rapida","Anleitung"]
[1.1000000000000001,6,"Allgemein","Blattname","Titelblatt","Page de couverture","Frontespizio","Titelblatt"]
[1.1000000000000001,7,"Allgemein","Blattname","Formular G1 + G2","Formulaire G1 + G2","Formulario G1 + G2","Formular G1 + G2"]
[1,8,"Allgemein","Blattname","Beschreibungen G2","Descriptions G2","Descrizioni G2",{"$f":"IF(Sprache=\"DE\",E12,IF(Sprache=\"FR\",F12,IF(Sprache=\"IT\",G12,\"Fehler: Sprache wählen\")))","v":"Beschreibungen G2"}]
[2,9,"Blatt Admin"]
[2,10,"Blatt Admin",null,"Version","Version ","Versione",{"$f":"IF(Sprache=\"DE\",E14,IF(Sprache=\"FR\",F14,IF(Sprache=\"IT\",G14,\"Fehler: Sprache wählen\")))","v":"Version"}]
[2,11,"Blatt Admin",null,"Version:","Version: ","Versione:","Version:"]
[2,12,"Blatt Admin",null,"Versionsdatum:","Date de la version:","Data della versione:","Versionsdatum:"]
[2,13,"Blatt Admin",null,"Dropdowns","Listes déroulantes","Menu dropdown","Dropdowns"]
[2,14,"Blatt Admin",null,"Anzahl Gebaeude","Nombre de bâtiments ","Numero di edifici","Anzahl Gebaeude"]
[2,15,"Blatt Admin",null,"Verwendetes Tool","Indication de l'outil ACE utilisé :","Indicazione del tool ACE utilizzato","Verwendetes Tool"]
[2,16,"Blatt Admin",null,"a) EVA-Tool der EnFK","a) outil ACE de l’EnFK ","a) tool ACE dell’EnFK ","a) EVA-Tool der EnFK"]
{"$rows_left_out":203}
{"sheet":"Anleitung","index":2,"n_rows":44,"n_cols":12,"rows_kept":44,"cut":false,"hidden":false,"merged":[[8,0,8,11],[12,3,12,11],[24,1,24,11],[42,0,42,11],[13,3,13,11],[14,3,14,11],[25,1,25,11],[26,1,26,11],[27,1,27,11],[38,1,38,11],[39,1,39,11],[19,1,19,11],[20,1,20,11],[15,3,15,11]]}
[{"$f":"Sprachen!H42","v":"Kurzanleitung"}]
[{"$f":"fusszeile_links","v":"Ausführungsbestätigung zur EVA"}]
[]
[]
[{"$f":"Sprachen!H44","v":"Sprache"},null,"DE"]
["DE: Bitte wählen Sie Ihre gewünschte Sprache",null,null,null,null,"FR: Veuillez choisir votre langue",null,null,null,"IT: Scegliere la lingua"]
[]
[{"$f":"Sprachen!H45","v":"Zweck und Ziel"}]
[{"$f":"Sprachen!H46","v":"Dieses Tool dient zur Bestätigung der Ausführung von Massnahmen zur Reduktion des Energieverbrauchs von Gebäude und Anlagen, welche in der Energieverbrauchsanalyse (EVA) zur Umsetzung deklariert wurden. Ausserdem können zusätzliche Ersatzmassnahmen oder aus technischen Gründen wesentlich anders umgesetzte Massnahmen (als in der EVA vorgesehen) aufgeführt werden."}]
[]
[{"$f":"Sprachen!H47","v":"Aufbau"}]
[{"$f":"Sprachen!H48","v":"Dieses Excel-Tool besteht aus mehreren Arbeitsblättern:"}]
["-",{"$f":"Sprachen!H49","v":"Titelblatt:"},null,{"$f":"Sprachen!H50","v":"Allgemeine Angaben zum Unternehmen und Angabe des ursprünglich verwendeten EVA-Tools"}]
["-",{"$f":"Sprachen!H51","v":"Formular G1:"},null,{"$f":"Sprachen!H52","v":"Übertragung der Massnahmen aus Formular F1 des EVA-Tools und Bestätigung der Ausführung"}]
["-",{"$f":"Sprachen!H53","v":"Formular G2:"},null,{"$f":"Sprachen!H54","v":"Aufführen von Ersatzmassnahmen oder wesentlich anders umgesetzten Massnahmen"}]
["-",{"$f":"Sprachen!H55","v":"Beschreibungen G2:"},null,{"$f":"Sprachen!H56","v":"Beschreibungen der Ersatzmassnahmen von Formular G2"}]
[]
[{"$f":"Sprachen!H57","v":"Hinweis zur Energieträgergewichtung"}]
[{"$f":"Sprachen!H58","v":"Die Energieträgergewichtung erfolgt automatisch und gleich wie in der Version des EVA-Tools, die ursprünglich zur Erfassung der Massnahmen verwendeten wurde:"}]
["-",{"$f":"Sprachen!H59","v":"falls Sie das EVA-Tool der EnFK verwendet hatten: Elektrizität: 2, Heizöl & Erdgas: 1, Fernwärme/-kälte (inkl. externer Abwärme): 0.6, Holz & Biomasse: 0.7, Umweltwärme (inkl. interner Abwärme) & erneuerbare Stromeigenproduktion: 0"}]
{"$rows_left_out":25}
{"sheet":"Titelblatt","index":3,"n_rows":22,"n_cols":10,"rows_kept":22,"cut":false,"hidden":false,"merged":[[20,1,20,3],[20,5,20,13],[21,1,21,3],[22,1,22,3],[22,5,22,13],[21,10,21,13],[21,5,21,8],[12,5,12,13],[19,5,19,13],[15,5,15,8],[15,9,15,13],[17,5,17,13],[8,1,8,3],[8,6,8,8],[4,5,4,13],[5,5,5,13],[7,6,7,13],[8,10,8,13],[3,1,3,3],[3,5,3,13],[2,5,2,13],[12,1,12,3],[19,1,19,3],[11,5,11,13],[4,1,4,3],[7,1,7,3],[6,1,6,3],[5,1,5,3],[9,1,9,3],[11,1,11,3],[10,1,10,3],[9,6,9,13],[6,5,6,13],[10,5,10,13]]}
[]
[{"$f":"Sprachen!H77","v":"Ausführungsbestätigung zur Energieverbrauchsanalyse"}]
[{"$f":"Sprachen!H78","v":"Titelblatt"}]
[]
[null,{"$f":"Sprachen!H79","v":"Firmenname / Adresse:"}]
[]
[]
[null,{"$f":"Sprachen!H80","v":"Kontaktperson Firma:"},null,null,null,{"$f":"Sprachen!H81","v":"Name:"}]
[null,null,null,null,null,{"$f":"Sprachen!H82","v":"Tel.:"},null,null,null,{"$f":"Sprachen!H84","v":"  Fax:"}]
[null,null,null,null,null,{"$f":"Sprachen!H83","v":"Email:"}]
[]
[null,{"$f":"Sprachen!H85","v":"Betriebsstätte:"}]
[]
[]
[]
[null,{"$f":"Sprachen!H86","v":"Ursprünglich verwendetes EVA-Tool:"},null,null,null,null,null,null,null,{"$f":"Sprachen!H87","v":"(bei Unklarheiten bitte nachfolgenden Hinweis beachten)"}]
[null,null,null,null,null,{"$f":"Sprachen!H88","v":"Hinweis:"}]
[null,null,null,null,null,{"$f":"Sprachen!H89","v":"Bitte geben Sie hier an, ob zur Erfassung der Energieverbrauchsanalyse (EVA) ursprünglich:\na) das neue EVA-Tool der EnFK (mit EnFK-Logo auf dem Titelblatt, gleich wie in diesem Dokument), oder\nb) ein kantonsspezifisches Tool der zuständigen Stelle des Kantons (i.d.R. mit Kantonslogo auf dem Titelblatt) verwendet wurde.\nBei Fragen wenden Sie sich bitte an die zuständige Stelle des Kantons."}]
[]
[]
{"$rows_left_out":3}
{"sheet":"Formular G1 + G2","index":4,"n_rows":77,"n_cols":24,"rows_kept":77,"cut":false,"hidden":false,"merged":[[46,13,46,14],[47,13,47,14],[0,23,7,23],[0,19,10,19],[0,20,10,20],[0,21,10,21],[0,22,10,22],[27,1,27,2],[30,1,30,2],[31,1,31,2],[29,1,29,2],[23,1,23,2],[24,1,24,2],[26,1,26,2],[28,1,28,2],[14,1,14,2],[19,1,19,2],[20,1,20,2],[21,1,21,2],[22,1,22,2],[15,1,15,2],[16,1,16,2],[17,1,17,2],[18,1,18,2],[48,1,48,2],[49,1,49,2],[52,1,52,2],[53,1,53,2],[54,1,54,2],[57,10,57,16],[58,0,58,6],[58,10,58,16],[48,13,48,14],[49,13,49,14],[50,13,50,14],[51,13,51,14],[52,13,52,14],[56,1,56,2],[57,0,57,6],[29,14,29,16],[30,14,30,16],[31,14,31,16],[45,0,45,2],[46,1,46,2],[47,1,47,2],[42,3,42,4],[42,5,42,6],[41,3,41,7],[41,8,41,9],[42,13,42,14],[40,3,40,9],[36,0,36,16],[35,0,35,16],[32,10,32,16],[33,0,33,6],[32,0,32,6],[33,10,33,16],[40,0,41,0],[44,13,44,14],[42,15,43,15],[40,1,41,2],[42,0,44,2],[45,13,45,14],[13,1,13,2],[6,0,7,0],[6,1,7,2],[8,11,9,11],[77,2,77,5],[77,11,77,15],[75,0,75,5],[50,1,50,2],[51,1,51,2],[53,13,53,14],[54,13,54,14],[55,13,55,14],[59,0,59,6],[59,10,59,16],[73,0,73,16],[61,0,61,16],[70,0,70,16],[76,2,76,5],[76,11,76,15],[62,0,68,16],[71,0,71,16],[72,0,72,16],[74,0,74,16],[55,1,55,2],[0,17,10,17],[0,18,10,18],[25,14,25,16],[40,10,41,11],[40,12,41,12],[40,13,41,15],[40,16,41,16],[43,13,43,14],[3,7,3,8],[11,14,11,16],[12,14,12,16],[13,14,13,16],[5,0,5,16],[7,10,7,12],[6,10,6,11],[6,3,6,9],[9,1,9,2],[8,1,8,2],[8,3,8,4],[8,5,8,6],[7,3,7,7],[7,8,7,9],[11,1,11,2],[12,1,12,2],[6,13,7,16],[8,14,8,16],[9,14,9,16],[23,14,23,16],[24,14,24,16],[26,14,26,16],[27,14,27,16],[28,14,28,16],[18,14,18,16],[19,14,19,16],[22,14,22,16],[14,14,14,16],[15,14,15,16],[16,14,16,16],[17,14,17,16],[20,14,20,16],[21,14,21,16]]}
[{"$f":"Sprachen!H93","v":"Formular G1"},null,null,null,null,null,null,null,null,null,null,null,null,null,null,null,{"$f":"IF(Titelblatt!$F$12=\"\",\"\",Titelblatt!$F$12)","v":""},"FLAGS [ja/nein]","FLAGS [Begründung]","Eingabemeldung \"Art\"","Eingabemeldung \"Art\"","Eingabemeldung \"E-Kosten\"","Eingabemeldung \"E-Kosten\"","Eingabemeldung \"KE/Werterterh.\""]
[{"$f":"Sprachen!H94","v":"Bestätigung der Ausführung der in der EVA deklarierten Massnahmen"},null,null,null,null,null,null,null,null,null,null,null,null,null,null,null,{"$f":"IF(Titelblatt!$F$22=\"\",\"\",Titelblatt!$F$22)","v":""}]
[]
["a",{"$f":"Sprachen!H95","v":"Jahresendenergiebezug gewichtet gemäss EVA ¹⁾:"},null,null,null,null,null,null,null," kWh/a",{"$f":"Sprachen!H96","v":"1) Gem. EVA Formular C, Ziffer C.1 (aktuellstes Jahr)"}]
[]
[{"$f":"Sprachen!H97","v":"Übertragen Sie in die nachfolgende Tabelle alle in Formular F1 der EVA zur Umsetzung deklarierten neuen Massnahmen und bestätigen Sie anschliessend deren Ausführung."}]
[{"$f":"Sprachen!H98","v":"Nr."},{"$f":"Sprachen!H99","v":"Massnahmentitel"},null,{"$f":"Sprachen!H100","v":"Energieeinsparung"},null,null,null,null,null,null,{"$f":"Sprachen!H112","v":"Investitionen"},null,{"$f":"Sprachen!H113","v":"Payback"},{"$f":"Sprachen!H118","v":"Massnahme im Wesentlichen wie in EVA deklariert ausgeführt?"}]
[null,null,null,{"$f":"Sprachen!H101","v":"Ungewichtet"},null,null,null,null,{"$f":"Sprachen!H109","v":"Gewichtet ¹⁾"},null,{"$f":"Sprachen!H114","v":"(gemäss EVA Formular F1)"}]
[null,null,null,{"$f":"Sprachen!H102","v":"Einsparung 1"},null,{"$f":"Sprachen!H105","v":"Einsparung 2"},null,{"$f":"Sprachen!H108","v":"Total"},{"$f":"Sprachen!H110","v":"Total"},{"$f":"Sprachen!H111","v":"Anteil"},{"$f":"Sprachen!H115","v":"Total"},{"$f":"IF(LEFT(Verwendetes_Tool,1)=\"b\",Sprachen!H117,Sprachen!H116)","v":"KE"},null,{"$f":"Sprachen!H119","v":"ja"},{"$f":"Sprachen!H120","v":"= wie deklariert ausgeführt"},null,null,null,null,null,null,null,null,{"$f":"IF(LEFT(Verwendetes_Tool,1)=\"b\",Eingabemeldung(Sprachen!$H$190,Sprachen!$H$189,'Formular G1 + G2'!L9),Eingabemeldung(Sprachen!$H$187,Sprachen!$H$186,'Formular G1 + G2'!L9))","v":{"$error":"#NAME?"}}]
[null,null,null,{"$f":"Sprachen!H103","v":"Art"},"[kWh/a]",{"$f":"Sprachen!H106","v":"Art"},"[kWh/a]","[kWh/a]","[kWh/a]","[-]","[CHF]",null,"[a]",{"$f":"Sprachen!H122","v":"nein"},{"$f":"Sprachen!H123","v":"= nicht o. anders ausgeführt"}]
[{"$f":"Sprachen!H125","v":"Haustechnikanlagen / Gebäudehülle"}]
[null,null,null,null,null,null,null,{"$f":"IF(B12=\"\",\"\",E12+G12)","v":""},{"$f":"IF(OR(AND(E12<>\"\",D12=\"\"),AND(G12<>\"\",F12=\"\")),\"Art?\",IF(OR(B12=\"\",Verwendetes_Tool=\"\"),\"\",IF(LEFT(Verwendetes_Tool,1)=\"a\",IFERROR(E12*VLOOKUP(D12,Admin!$A$39:$B$44,2,FALSE),0)+IFERROR(G12*VLOOKUP(F12,Admin!$A$39:$B$44,2,FALSE),0),IF(D12=\"E\",(E12*2)+(IF(F12=\"E\",(G12*2),G12)),E12+(IF(F12=\"E\",(G12*2),G12))))))","v":""},{"$f":"IF(B12=\"\",\"\",IF(OR($H$4=0,$H$4=\"\"),0,I12/$H$4))","v":""},null,null,null,null,{"$f":"IF(N12=\"\",\"\",IF(OR(N12=\"ja\",N12=\"oui\",N12=\"si\"),Sprachen!$H$121,Sprachen!$H$124))","v":""},null,null,{"$f":"IF(OR(N12=\"ja\",N12=\"oui\",N12=\"si\"),1,0)","v":0},{"$f":"IF(OR(N12=\"nein\",N12=\"non\",N12=\"no\"),1,0)","v":0},{"$f":"Eingabemeldung(Sprachen!$H$182,Sprachen!$H$181,'Formular G1 + G2'!D12)","v":{"$error":"#NAME?"}},{"$f":"Eingabemeldung(Sprachen!$H$182,Sprachen!$H$181,'Formular G1 + G2'!F12)","v":{"$error":"#NAME?"}},null,null,{"$f":"IF(LEFT(Verwendetes_Tool,1)=\"b\",Eingabemeldung(Sprachen!$H$190,Sprachen!$H$189,'Formular G1 + G2'!L12),Eingabemeldung(Sprachen!$H$187,Sprachen!$H$186,'Formular G1 + G2'!L12))","v":{"$error":"#NAME?"}}]
[null,null,null,null,null,null,null,{"$f":"IF(B13=\"\",\"\",E13+G13)","v":""},{"$f":"IF(OR(B13=\"\",Verwendetes_Tool=\"\"),\"\",IF(LEFT(Verwendetes_Tool,1)=\"a\",IFERROR(E13*VLOOKUP(D13,Admin!$A$39:$B$44,2,FALSE),0)+IFERROR(G13*VLOOKUP(F13,Admin!$A$39:$B$44,2,FALSE),0),IF(D13=\"E\",(E13*2)+(IF(F13=\"E\",(G13*2),G13)),E13+(IF(F13=\"E\",(G13*2),G13)))))","v":""},"",null,null,null,null,{"$f":"IF(N13=\"\",\"\",IF(OR(N13=\"ja\",N13=\"oui\",N13=\"si\"),Sprachen!$H$121,Sprachen!$H$124))","v":""},null,null,{"$f":"IF(OR(N13=\"ja\",N13=\"oui\",N13=\"si\"),1,0)","v":0},{"$f":"IF(OR(N13=\"nein\",N13=\"non\",N13=\"no\"),1,0)","v":0},{"$f":"Eingabemeldung(Sprachen!$H$182,Sprachen!$H$181,'Formular G1 + G2'!D13)","v":{"$error":"#NAME?"}},{"$f":"Eingabemeldung(Sprachen!$H$182,Sprachen!$H$181,'Formular G1 + G2'!F13)","v":{"$error":"#NAME?"}},null,null,{"$f":"IF(LEFT(Verwendetes_Tool,1)=\"b\",Eingabemeldung(Sprachen!$H$190,Sprachen!$H$189,'Formular G1 + G2'!L13),Eingabemeldung(Sprachen!$H$187,Sprachen!$H$186,'Formular G1 + G2'!L13))","v":{"$error":"#NAME?"}}]
[null,null,null,null,null,null,null,"",{"$f":"IF(OR(B14=\"\",Verwendetes_Tool=\"\"),\"\",IF(LEFT(Verwendetes_Tool,1)=\"a\",IFERROR(E14*VLOOKUP(D14,Admin!$A$39:$B$44,2,FALSE),0)+IFERROR(G14*VLOOKUP(F14,Admin!$A$39:$B$44,2,FALSE),0),IF(D14=\"E\",(E14*2)+(IF(F14=\"E\",(G14*2),G14)),E14+(IF(F14=\"E\",(G14*2),G14)))))","v":""},"",null,null,null,null,{"$f":"IF(N14=\"\",\"\",IF(OR(N14=\"ja\",N14=\"oui\",N14=\"si\"),Sprachen!$H$121,Sprachen!$H$124))","v":""},null,null,0,0,{"$f":"Eingabemeldung(Sprachen!$H$182,Sprachen!$H$181,'Formular G1 + G2'!D14)","v":{"$error":"#NAME?"}},{"$f":"Eingabemeldung(Sprachen!$H$182,Sprachen!$H$181,'Formular G1 + G2'!F14)","v":{"$error":"#NAME?"}},null,null,{"$f":"IF(LEFT(Verwendetes_Tool,1)=\"b\",Eingabemeldung(Sprachen!$H$190,Sprachen!$H$189,'Formular G1 + G2'!L14),Eingabemeldung(Sprachen!$H$187,Sprachen!$H$186,'Formular G1 + G2'!L14))","v":{"$error":"#NAME?"}}]
[null,null,null,null,null,null,null,"",{"$f":"IF(OR(B15=\"\",Verwendetes_Tool=\"\"),\"\",IF(LEFT(Verwendetes_Tool,1)=\"a\",IFERROR(E15*VLOOKUP(D15,Admin!$A$39:$B$44,2,FALSE),0)+IFERROR(G15*VLOOKUP(F15,Admin!$A$39:$B$44,2,FALSE),0),IF(D15=\"E\",(E15*2)+(IF(F15=\"E\",(G15*2),G15)),E15+(IF(F15=\"E\",(G15*2),G15)))))","v":""},"",null,null,null,null,{"$f":"IF(N15=\"\",\"\",IF(OR(N15=\"ja\",N15=\"oui\",N15=\"si\"),Sprachen!$H$121,Sprachen!$H$124))","v":""},null,null,0,0,{"$f":"Eingabemeldung(Sprachen!$H$182,Sprachen!$H$181,'Formular G1 + G2'!D15)","v":{"$error":"#NAME?"}},{"$f":"Eingabemeldung(Sprachen!$H$182,Sprachen!$H$181,'Formular G1 + G2'!F15)","v":{"$error":"#NAME?"}},null,null,{"$f":"IF(LEFT(Verwendetes_Tool,1)=\"b\",Eingabemeldung(Sprachen!$H$190,Sprachen!$H$189,'Formular G1 + G2'!L15),Eingabemeldung(Sprachen!$H$187,Sprachen!$H$186,'Formular G1 + G2'!L15))","v":{"$error":"#NAME?"}}]
[null,null,null,null,null,null,null,"",{"$f":"IF(OR(B16=\"\",Verwendetes_Tool=\"\"),\"\",IF(LEFT(Verwendetes_Tool,1)=\"a\",IFERROR(E16*VLOOKUP(D16,Admin!$A$39:$B$44,2,FALSE),0)+IFERROR(G16*VLOOKUP(F16,Admin!$A$39:$B$44,2,FALSE),0),IF(D16=\"E\",(E16*2)+(IF(F16=\"E\",(G16*2),G16)),E16+(IF(F16=\"E\",(G16*2),G16)))))","v":""},"",null,null,null,null,{"$f":"IF(N16=\"\",\"\",IF(OR(N16=\"ja\",N16=\"oui\",N16=\"si\"),Sprachen!$H$121,Sprachen!$H$124))","v":""},null,null,0,0,{"$f":"Eingabemeldung(Sprachen!$H$182,Sprachen!$H$181,'Formular G1 + G2'!D16)","v":{"$error":"#NAME?"}},{"$f":"Eingabemeldung(Sprachen!$H$182,Sprachen!$H$181,'Formular G1 + G2'!F16)","v":{"$error":"#NAME?"}},null,null,{"$f":"IF(LEFT(Verwendetes_Tool,1)=\"b\",Eingabemeldung(Sprachen!$H$190,Sprachen!$H$189,'Formular G1 + G2'!L16),Eingabemeldung(Sprachen!$H$187,Sprachen!$H$186,'Formular G1 + G2'!L16))","v":{"$error":"#NAME?"}}]
[null,null,null,null,null,null,null,"",{"$f":"IF(OR(B17=\"\",Verwendetes_Tool=\"\"),\"\",IF(LEFT(Verwendetes_Tool,1)=\"a\",IFERROR(E17*VLOOKUP(D17,Admin!$A$39:$B$44,2,FALSE),0)+IFERROR(G17*VLOOKUP(F17,Admin!$A$39:$B$44,2,FALSE),0),IF(D17=\"E\",(E17*2)+(IF(F17=\"E\",(G17*2),G17)),E17+(IF(F17=\"E\",(G17*2),G17)))))","v":""},"",null,null,null,null,{"$f":"IF(N17=\"\",\"\",IF(OR(N17=\"ja\",N17=\"oui\",N17=\"si\"),Sprachen!$H$121,Sprachen!$H$124))","v":""},null,null,0,0,{"$f":"Eingabemeldung(Sprachen!$H$182,Sprachen!$H$181,'Formular G1 + G2'!D17)","v":{"$error":"#NAME?"}},{"$f":"Eingabemeldung(Sprachen!$H$182,Sprachen!$H$181,'Formular G1 + G2'!F17)","v":{"$error":"#NAME?"}},null,null,{"$f":"IF(LEFT(Verwendetes_Tool,1)=\"b\",Eingabemeldung(Sprachen!$H$190,Sprachen!$H$189,'Formular G1 + G2'!L17),Eingabemeldung(Sprachen!$H$187,Sprachen!$H$186,'Formular G1 + G2'!L17))","v":{"$error":"#NAME?"}}]
[null,null,null,null,null,null,null,"",{"$f":"IF(OR(B18=\"\",Verwendetes_Tool=\"\"),\"\",IF(LEFT(Verwendetes_Tool,1)=\"a\",IFERROR(E18*VLOOKUP(D18,Admin!$A$39:$B$44,2,FALSE),0)+IFERROR(G18*VLOOKUP(F18,Admin!$A$39:$B$44,2,FALSE),0),IF(D18=\"E\",(E18*2)+(IF(F18=\"E\",(G18*2),G18)),E18+(IF(F18=\"E\",(G18*2),G18)))))","v":""},"",null,null,null,null,{"$f":"IF(N18=\"\",\"\",IF(OR(N18=\"ja\",N18=\"oui\",N18=\"si\"),Sprachen!$H$121,Sprachen!$H$124))","v":""},null,null,0,0,{"$f":"Eingabemeldung(Sprachen!$H$182,Sprachen!$H$181,'Formular G1 + G2'!D18)","v":{"$error":"#NAME?"}},{"$f":"Eingabemeldung(Sprachen!$H$182,Sprachen!$H$181,'Formular G1 + G2'!F18)","v":{"$error":"#NAME?"}},null,null,{"$f":"IF(LEFT(Verwendetes_Tool,1)=\"b\",Eingabemeldung(Sprachen!$H$190,Sprachen!$H$189,'Formular G1 + G2'!L18),Eingabemeldung(Sprachen!$H$187,Sprachen!$H$186,'Formular G1 + G2'!L18))","v":{"$error":"#NAME?"}}]
[null,null,null,null,null,null,null,"",{"$f":"IF(OR(B19=\"\",Verwendetes_Tool=\"\"),\"\",IF(LEFT(Verwendetes_Tool,1)=\"a\",IFERROR(E19*VLOOKUP(D19,Admin!$A$39:$B$44,2,FALSE),0)+IFERROR(G19*VLOOKUP(F19,Admin!$A$39:$B$44,2,FALSE),0),IF(D19=\"E\",(E19*2)+(IF(F19=\"E\",(G19*2),G19)),E19+(IF(F19=\"E\",(G19*2),G19)))))","v":""},"",null,null,null,null,{"$f":"IF(N19=\"\",\"\",IF(OR(N19=\"ja\",N19=\"oui\",N19=\"si\"),Sprachen!$H$121,Sprachen!$H$124))","v":""},null,null,0,0,{"$f":"Eingabemeldung(Sprachen!$H$182,Sprachen!$H$181,'Formular G1 + G2'!D19)","v":{"$error":"#NAME?"}},{"$f":"Eingabemeldung(Sprachen!$H$182,Sprachen!$H$181,'Formular G1 + G2'!F19)","v":{"$error":"#NAME?"}},null,null,{"$f":"IF(LEFT(Verwendetes_Tool,1)=\"b\",Eingabemeldung(Sprachen!$H$190,Sprachen!$H$189,'Formular G1 + G2'!L19),Eingabemeldung(Sprachen!$H$187,Sprachen!$H$186,'Formular G1 + G2'!L19))","v":{"$error":"#NAME?"}}]
[null,null,null,null,null,null,null,"",{"$f":"IF(OR(B20=\"\",Verwendetes_Tool=\"\"),\"\",IF(LEFT(Verwendetes_Tool,1)=\"a\",IFERROR(E20*VLOOKUP(D20,Admin!$A$39:$B$44,2,FALSE),0)+IFERROR(G20*VLOOKUP(F20,Admin!$A$39:$B$44,2,FALSE),0),IF(D20=\"E\",(E20*2)+(IF(F20=\"E\",(G20*2),G20)),E20+(IF(F20=\"E\",(G20*2),G20)))))","v":""},"",null,null,null,null,{"$f":"IF(N20=\"\",\"\",IF(OR(N20=\"ja\",N20=\"oui\",N20=\"si\"),Sprachen!$H$121,Sprachen!$H$124))","v":""},null,null,0,0,{"$f":"Eingabemeldung(Sprachen!$H$182,Sprachen!$H$181,'Formular G1 + G2'!D20)","v":{"$error":"#NAME?"}},{"$f":"Eingabemeldung(Sprachen!$H$182,Sprachen!$H$181,'Formular G1 + G2'!F20)","v":{"$error":"#NAME?"}},null,null,{"$f":"IF(LEFT(Verwendetes_Tool,1)=\"b\",Eingabemeldung(Sprachen!$H$190,Sprachen!$H$189,'Formular G1 + G2'!L20),Eingabemeldung(Sprachen!$H$187,Sprachen!$H$186,'Formular G1 + G2'!L20))","v":{"$error":"#NAME?"}}]
{"$rows_left_out":58}
{"sheet":"Beschreibungen G2","index":5,"n_rows":47,"n_cols":3,"rows_kept":47,"cut":false,"hidden":false,"merged":[[3,0,3,2]]}
[{"$f":"Sprachen!H193","v":"Beschreibungen G2"},null,{"$f":"IF(Titelblatt!$F$12=\"\",\"\",Titelblatt!$F$12)","v":""}]
[{"$f":"Sprachen!H194","v":"Beschreibung der Ersatzmassnahmen"},null,{"$f":"IF(Titelblatt!$F$22=\"\",\"\",Titelblatt!$F$22)","v":""}]
[]
[{"$f":"Sprachen!H195","v":"Hinweise:"},{"$error":"#REF!"},0]
[{"$f":"Sprachen!H196","v":"- Die im Formular G2 aufgeführten Massnahmen müssen in diesem Arbeitsblatt oder einem Beilagendokument detailliert und nachvollziehbar beschrieben werden."}]
[{"$f":"Sprachen!H197","v":"- Die Beschreibungsfelder werden erst angezeigt, wenn die Massnahmentitel in Formular G2 eingetragen wurden."}]
[{"$f":"Sprachen!H198","v":"- Wird für die Massnahmenbeschreibung mehr Platz benötigt, kann die Zeilenhöhe manuell angepasst werden."}]
[{"$f":"Sprachen!H199","v":"- Zeilenumbrüche können durch die Tastenkombination \"Alt\" + \"Enter\" eingefügt werden."}]
[]
[{"$f":"Sprachen!H200","v":"Ersatzmassnahme 1, Formular G2:"},{"$f":"IF(ersatz1=\"\",Sprachen!H210,ersatz1)","v":"Massnahme 1 wurde nicht eingetragen"}]
[{"$f":"Sprachen!H220","v":"Detaillierte Beschreibung der Massnahme:"},{"$f":"Sprachen!H221","v":"Beschreibung der Einsparberechnung:"},{"$f":"Sprachen!H222","v":"Beschreibung der Kosten:"}]
[]
[]
[{"$f":"Sprachen!H201","v":"Ersatzmassnahme 2, Formular G2:"},{"$f":"IF(ersatz2=\"\",Sprachen!H211,ersatz2)","v":"Massnahme 2 wurde nicht eingetragen"}]
[{"$f":"Sprachen!H220","v":"Detaillierte Beschreibung der Massnahme:"},{"$f":"Sprachen!H221","v":"Beschreibung der Einsparberechnung:"},{"$f":"Sprachen!H222","v":"Beschreibung der Kosten:"}]
[]
[]
[{"$f":"Sprachen!H202","v":"Ersatzmassnahme 3, Formular G2:"},{"$f":"IF(ersatz3=\"\",Sprachen!H212,ersatz3)","v":"Massnahme 3 wurde nicht eingetragen"}]
[{"$f":"Sprachen!H220","v":"Detaillierte Beschreibung der Massnahme:"},{"$f":"Sprachen!H221","v":"Beschreibung der Einsparberechnung:"},{"$f":"Sprachen!H222","v":"Beschreibung der Kosten:"}]
[]
{"$rows_left_out":27}